{"text_format":"1","workbook":"xlsx","n_sheets":17,"sheets":["FrontCover","Contents","The CoP","Commentary page","Definitions","Legal Definitions","Number of Searches","Search Reason","Overall search outcomes","Receipts","Search Different to Outcome","Items Found - Drugs","Items Found - Weapons","Items Found - Other","Searches by Ethnicity ","Searches By Age and Gender","S60 Auths"],"not_rendered":{"charts":0,"images":1,"macros":1,"external_links":0,"defined_names":18,"comments":0,"pivot_tables":0},"unopened":[],"bounds":{"document_bytes":16777216,"sheet_cells":100000,"rows_first":2000,"rows_last":500,"rows_between":2000,"halvings":0,"cell_chars":16384,"cell_head_chars":4096},"cells_cut":0,"cells_raw":0,"read":"whole","date_system":"1900"}

{"sheet":"FrontCover","index":0,"n_rows":36,"n_cols":1,"rows_kept":36,"cut":false,"hidden":false,"merged":[]}
[]
["PLEASE REPLACE THIS PAGE WITH THE STANDARD MI COVER"]
[]
[]
[]
[]
[]
[]
[]
[]
[]
[]
[]
[]
[]
["Management Information"]
[]
["National Stop and Search"]
["Database: Quarterly Report"]
[]
{"$rows_left_out":17}
{"sheet":"Contents","index":1,"n_rows":51,"n_cols":6,"rows_kept":51,"cut":false,"hidden":false,"merged":[[50,3,50,5]]}
["Contents"]
[]
["The Code of Practice",2]
["Commentary Notes",3]
["Definition of a Stop and Search",4]
["Stop and Searches, Legislation ",5]
[]
["Stop and Searches"]
["Stop and Searches by Local Authority",6]
["Stop and Searches by Legislation",7]
["Search Outcomes",8]
["Stop and Search Receipts",9]
[]
["Items Found During a Search"]
["Main Item Found Classification by Search Reason",10]
["Drugs Found by Local Authority",11]
["Weapons Found by Local Authority",12]
["Other Items Found by Local Authority",13]
[]
["Demographic of Nominals Searched"]
{"$rows_left_out":32}
{"sheet":"The CoP","index":2,"n_rows":42,"n_cols":1,"rows_kept":42,"cut":false,"hidden":false,"merged":[]}
["The Code of Practice on the Exercise by Constables of Powers of Stop"]
["and Search of the Person in Scotland"]
[]
["The Code came into effect on 11 May 2017. The Code governs all situations in which constables stop and search "]
["a person without first making an arrest, unless the search is expressly excluded, either under the Code, by "]
["statute, or by virtue of the search being subject to a separate statutory Code or guidance as to its exercise. The "]
["Code also sets out the requirements to be followed by the Police for recording information in relation to all stop"]
["and search activity covered by the Code."]
[]
["The Code requires as soon as practicable after the end of each reporting year (ending 31 March), the Chief "]
["Constable of a relevant police service must publish, information on how many times during the reporting year a "]
["stop and search was carried out in Scotland by constables of that service. In addition, so far as practicable, the "]
["information is to disclose:"]
[]
["(a) the number of stops and searches carried out under each statutory power;"]
["(b) how many persons were searched on two or more occasions"]
["(c) the age and gender, and the ethnic and national origin, of the persons searched"]
["(d) the proportion of searches that resulted in:"]
["(i) something being recovered by a constable, including information as to the number of cases in which the item "]
["recovered was of the type suspected by the constable at the outset of the search"]
{"$rows_left_out":23}
{"sheet":"Commentary page","index":3,"n_rows":41,"n_cols":1,"rows_kept":41,"cut":false,"hidden":false,"merged":[[30,0,30,12],[31,0,31,12]]}
["Commentary Notes on Management Information"]
[]
["Force Level Highlights"]
["1. All statistics are provisional and should be treated as management information. All data have been extracted "]
["from Police Scotland internal systems and are correct as of 9th October 2024."]
[]
["2. This report shows the data of the enhanced database 1st April 2024 – 30th September 2024."]
[]
["3. This data shows that Police Scotland is delivering the improvements set out in the Stop and Search "]
["Improvement Plan and is committed to sustaining and building on those improvements and maintaining "]
["community confidence."]
[]
["4. An enhanced database was rolled out across Scotland on 1st June 2015 which included additional validations "]
["designed to improve the quality of the data by preventing inaccurate data capture through input error. Further "]
["enhancements have followed, significantly allowing more detail to be recorded since the introduction of the Code "]
["of Practice. Following the review of the data captured on the National Stop and Search Database for the period "]
["specified, it is evident that the introduction of these validation checks has made a significant impact on the level "]
["of data input errors."]
[]
["5. In relation to outcomes the National Stop Search Unit (NSSU) do not validate or compare search outcomes "]
{"$rows_left_out":22}
{"sheet":"Definitions","index":4,"n_rows":19,"n_cols":1,"rows_kept":19,"cut":false,"hidden":false,"merged":[]}
["Definition of a Stop and Search"]
[]
[]
[]
["Stop and Search"]
["A stop and search is one conducted by a police officer in the course of their duties where a person who is not in police"]
["custody is searched using a specific statutory provision or in accordance with a search warrant issued by a court in "]
["Scotland."]
[]
["Positive Stop and Search"]
["A positive stop and search is when an item is recovered where possession of same implies criminality on the part "]
["of the person being searched or any other or where an item has been recovered which is potentially harmful."]
[]
["N.B. When a stop and search under a statutory provision has taken place and alcohol, tobacco or NPS is recovered, "]
["depending on the circumstances this should be recorded as a positive stop and search on the Stop and Search Database."]
[]
["Recordable Stop and Search (must be recorded on the National Stop and Search Database)"]
["A recordable stop and search is any stop and search, with the exception of condition of entry searches (Section 67 Criminal "]
["Justice (Scotland) Act 2016) or Schedule 7 of the Terrorism Act 2000 (which is governed by different Codes of Practice)."]

{"sheet":"Legal Definitions","index":5,"n_rows":51,"n_cols":2,"rows_kept":51,"cut":false,"hidden":false,"merged":[]}
["Stop and Searches, Legislation"]
[]
[]
[]
["The following table identifies the type of searches recorded on the National Stop and Search Database, along with the specific legislation relative to each search type:\n"]
[]
["Search Type","Recordable Statute"]
[]
["Search Warrants ","S109(1) Copyright, Designs and Patents Act 1988 (Piracy and trademark offences etc)"]
["Search Warrants ","S142(1) Criminal Justice Act, 1988 (Search of premises for offensive weapons)"]
["Search Warrants ","S23(3) Misuse Of Drugs Act 1971"]
["Search Warrants ","S24(1) Forgery and Counterfeiting Act, 1981 (Search for counterfeit money)"]
["Search Warrants ","S27 Deer (Scotland) Act 1996"]
["Search Warrants ","S28B(4) Immigration Act 1971"]
["Search Warrants ","S292(3) Mental Health Care and Treatment Scotland Act 2003"]
["Search Warrants ","S42(1) Terrorism Act 2000"]
["Search Warrants ","S46(1) Firearms Act 1968"]
["Search Warrants ","Other Legislation"]
["Drugs ","S23(2) Misuse of Drugs Act 1971 (Controlled Drugs) "]
["Drugs ","S23A Misuse of Drugs Act 1971 (Temp Class Drugs) "]
{"$rows_left_out":32}
{"sheet":"Number of Searches","index":6,"n_rows":45,"n_cols":12,"rows_kept":45,"cut":false,"hidden":false,"merged":[[47,0,47,4]]}
["Table 1.1"]
["Stop and Searches by Local Authority - Police Scotland"]
[{"$f":"CONCATENATE(\"Period: \",L7)","v":"Period: April to September 2024"}]
[]
[null,"Local Authority ","Number of Searches","Positive Searches","Positive Rate (%)"]
[]
["North",null,null,null,null,null,null,null,null,null,null,"April to September 2024"]
[null,"Highland",519,229,{"$f":"D8/C8*100","v":44.123314065510598}]
[null,"Orkney Islands",48,16,{"$f":"D9/C9*100","v":33.333333333333329}]
[null,"Shetland Islands",69,23,33.333333333333329]
[null,"Eilean Siar",32,14,43.75]
[null,"Aberdeen City",394,146,37.055837563451774]
[null,"Aberdeenshire",513,178,34.697855750487328]
[null,"Moray",129,39,30.232558139534881]
[null,"Perth and Kinross",78,35,44.871794871794876]
[null,"Dundee",192,89,46.354166666666671]
[null,"Angus",87,39,44.827586206896555]
[]
["East"]
[null,"Fife",194,80,41.237113402061851]
{"$rows_left_out":26}
{"sheet":"Search Reason","index":7,"n_rows":89,"n_cols":4,"rows_kept":89,"cut":false,"hidden":false,"merged":[]}
["Table 1.2"]
["Stop and Search by Legislation - Police Scotland"]
[{"$f":"'Number of Searches'!$A$3","v":"Period: April to September 2024"}]
[]
["Legislation","Number of Searches","Positive Searches","Positive Rate (%)"]
[]
["Drugs",{"$f":"SUM(B8:B9)","v":13152},{"$f":"SUM(C8:C9)","v":3552},{"$f":"C7/B7*100","v":27.007299270072991}]
["S23(2) Misuse of Drugs Act 1971 (Controlled Drugs) ",13110,3546,{"$f":"C8/B8*100","v":27.048054919908466}]
["S23A Misuse of Drugs Act 1971 (Temp Class Drugs) ",42,6,{"$f":"IFERROR(C9/B9*100,\"-\")","v":14.285714285714285}]
[]
["NPS",{"$f":"B12","v":"-"},{"$f":"C12","v":"-"},{"$f":"IFERROR(C11/B11*100,\"-\")","v":"-"}]
["S36 Psychoactive Substances Act 2016 (Supply etc.) ","-","-",{"$f":"IFERROR(C12/B12*100,\"-\")","v":"-"}]
[]
["Weapons",{"$f":"SUM(B15:B18)","v":1673},{"$f":"SUM(C15:C18)","v":304},{"$f":"C14/B14*100","v":18.170950388523611}]
["S48(1) Criminal Law (Cons) (Scot) Act 1995 (Offensive weapons) ",655,109,16.641221374045799]
["S49(B) Criminal Law (Cons) (Scot) Act 1995 (Offensive weapons in Schools) ",23,5,21.739130434782609]
["S50 Criminal Law (Cons) (Scot) Act 1995 (Bladed or Pointed Articles) ",995,190,19.095477386934672]
["    S11 Offensive Weapons Act 2019 (Corrosive Substances)","-","-",{"$f":"IFERROR(C18/B18*100,\"-\")","v":"-"}]
["Stolen Property",{"$f":"B20","v":1007},{"$f":"C20","v":489},48.560079443892754]
["S60 Civic Government (Scot) Act 1982 ",1007,489,48.560079443892754]
{"$rows_left_out":70}
{"sheet":"Overall search outcomes","index":8,"n_rows":23,"n_cols":3,"rows_kept":23,"cut":false,"hidden":false,"merged":[]}
["Table 1.3"]
["Search Outcomes - Police Scotland"]
[{"$f":"'Number of Searches'!$A$3","v":"Period: April to September 2024"}]
[]
["Disposal","Number of Searches","% Of Total Searches"]
[]
["Fixed Penalty Notice",69,{"$f":"B7/'Number of Searches'!C45*100","v":0.36319612590799033}]
["SPR2",2921,{"$f":"B8/'Number of Searches'!C45*100","v":15.375302663438257}]
["No Further Action",11088,{"$f":"B9/'Number of Searches'!C45*100","v":58.364038319823145}]
["IVPD",883,{"$f":"B10/'Number of Searches'!C45*100","v":4.6478576692283395}]
["SID Log",4114,{"$f":"B11/'Number of Searches'!C45*100","v":21.654911043267713}]
["Recorded Police Warning",1984,{"$f":"IF(B12=\"-\",\"-\",B12/'Number of Searches'!C45*100)","v":10.443204547847142}]
[]
[]
["Key:     SPR2 – Standard Prosecution Reports"]
["             IVPD – Interim Vulnerable Persons Database"]
["             SID - Scottish Intelligence Database"]
["3 - Any anomilies in percentage changes are due to rounding up to the nearest decimal place."]
["4 - Some searches are recorded with more than one disposal so totals will not equal the actual number of stop and searches."]
["5 - A search can have more than one disposal from the list and provides the outcome and/or further action taken by officers."]
{"$rows_left_out":4}
{"sheet":"Receipts","index":9,"n_rows":13,"n_cols":5,"rows_kept":13,"cut":false,"hidden":false,"merged":[]}
["Table 1.4"]
["Stop and Search Receipts - Police Scotland"]
[{"$f":"'Number of Searches'!$A$3","v":"Period: April to September 2024"}]
[]
[null,null,"Number of Searches","Receipts Issued","Issue Rate (%)"]
[]
[]
["Force",null,18998,12425,{"$f":"D8/C8*100","v":65.401621223286668}]
[]
[]
["8 - Officers may not issue a receipt if the person searched refuses to accept it or if the officer is called "]
["to an urgent incident. In all cases the record will be subject to a review to ensure compliance with the "]
["Code of Practice."]

{"sheet":"Search Different to Outcome","index":10,"n_rows":27,"n_cols":15,"rows_kept":27,"cut":false,"hidden":false,"merged":[]}
["Table 2.1"]
["Main Item Found Classification by Search Reason - Police Scotland"]
[{"$f":"'Number of Searches'!A3","v":"Period: April to September 2024"}]
[]
[null,null,null,null,null,null,null,"Main Item Found Classification"]
["Reason for Search","Total Positive Searches","Drugs","NPS","Stolen Property","Weapons","Firearms","Fireworks","Controlled Container","Controlled Article","Alcohol","Tobacco and Cigarette Papers","Money","Other","Aviation"]
[]
["Drugs",{"$f":"'Search Reason'!C7","v":3552},3337,10,21,160,1,1,5,"-",65,45,35,40,"-"]
["New Psychoactive Substances",{"$f":"'Search Reason'!C11","v":"-"},"-","-","-","-","-","-","-","-","-","-","-","-","-"]
["Stolen Property",{"$f":"'Search Reason'!C19","v":489},41,1,386,31,1,"-","-","-",58,4,4,24,"-"]
["Weapons",{"$f":"'Search Reason'!C14","v":304},63,1,5,233,2,"-","-","-",12,3,"-",6,"-"]
["Firearms",{"$f":"'Search Reason'!C25","v":10},1,"-","-",3,8,"-","-","-","-","-","-",1,"-"]
["Fireworks",{"$f":"IF('Search Reason'!C29=0,\"-\",'Search Reason'!C29)","v":6},1,"-","-",2,"-",2,"-","-",1,"-","-",1,"-"]
["Aviation",{"$f":"IF('Search Reason'!C47=0,\"-\",'Search Reason'!C47)","v":"-"},"-","-","-","-","-","-","-","-","-","-","-","-","-"]
["Wildlife",{"$f":"IF('Search Reason'!C38= \"0\",\"-\",'Search Reason'!C38)","v":1},1,"-","-","-","-","-","-","-","-","-","-","-","-"]
["Sporting Events",{"$f":"'Search Reason'!C22","v":6},1,"-","-","-","-","-","-","-",5,"-","-","-","-"]
["Public Order",{"$f":"IF('Search Reason'!C35=0,\"-\",'Search Reason'!C35)","v":"-"},"-","-","-","-","-","-","-","-","-","-","-","-","-"]
["Proceed of Crime",{"$f":"IF('Search Reason'!C64=0,\"-\",'Search Reason'!C64)","v":"-"},"-","-","-","-","-","-","-","-","-","-","-","-","-"]
["Care & Welfare",{"$f":"'Search Reason'!C68","v":106},66,"-",2,25,2,"-","-","-",3,6,"-",9,"-"]
["Warrant",{"$f":"'Search Reason'!C52","v":282},255,"-",5,13,5,"-","-","-","-","-",8,18,"-"]
{"$rows_left_out":8}
{"sheet":"Items Found - Drugs","index":11,"n_rows":49,"n_cols":7,"rows_kept":49,"cut":false,"hidden":false,"merged":[]}
["Table 2.2"]
["Drugs found by Local Authority Area - Police Scotland"]
[{"$f":"'Number of Searches'!$A$3","v":"Period: April to September 2024"}]
[]
[null,"Local Authority","Class A","Class B","Class C","NPS","Total"]
[]
[null,null,"Number of searches where drugs were found"]
["North"]
[null,"Highland",66,141,16,"-",{"$f":"SUM(C9:F9)","v":223}]
[null,"Orkney Islands",5,10,"-","-",15]
[null,"Shetland Islands",14,8,4,"-",26]
[null,"Eilean Siar",4,9,2,"-",{"$f":"IF(SUM(C12:F12) =0,\"-\",SUM(C12:F12))","v":15}]
[null,"Aberdeen City",44,82,15,"-",141]
[null,"Aberdeenshire",45,117,10,2,174]
[null,"Moray",13,26,"-","-",39]
[null,"Perth & Kinross",2,18,7,"-",27]
[null,"Dundee",14,19,18,"-",51]
[null,"Angus",4,17,4,"-",{"$f":"SUM(C18:F18)","v":25}]
[]
["East"]
{"$rows_left_out":30}
{"sheet":"Items Found - Weapons","index":12,"n_rows":49,"n_cols":8,"rows_kept":49,"cut":false,"hidden":false,"merged":[[48,0,48,6]]}
["Table 2.3"]
["Weapons found by Local Authority Area - Police Scotland"]
[{"$f":"'Number of Searches'!$A$3","v":"Period: April to September 2024"}]
[]
[null,"Local Authority","Bladed Instrument","Blunt Instrument","Pointed Article","Pointed Instrument","Other","Total"]
[]
[null,null,"Number of searches where weapons were found"]
["North"]
[null,"Highland",7,2,"-","-",1,{"$f":"SUM(C9:G9)","v":10}]
[null,"Orkney Islands",1,"-","-","-","-",{"$f":"IF(SUM(C10:G10) =0,\"-\",SUM(C10:G10))","v":1}]
[null,"Shetland Islands","-","-","-","-","-",{"$f":"IF(SUM(C11:G11) =0,\"-\",SUM(C11:G11))","v":"-"}]
[null,"Eilean Siar","-","-","-","-","-",{"$f":"IF(SUM(C12:G12)=0,\"-\",SUM(C12:G12))","v":"-"}]
[null,"Aberdeen City",6,"-",4,"-","-",10]
[null,"Aberdeenshire",4,4,1,"-",1,{"$f":"IF(SUM(C14:G14)=0,\"-\",SUM(C14:G14))","v":10}]
[null,"Moray","-",1,"-","-","-",{"$f":"IF(SUM(C15:G15)=0,\"-\",SUM(C15:G15))","v":1}]
[null,"Perth & Kinross",4,1,"-","-",1,{"$f":"IF(SUM(C16:G16)=0,\"-\",SUM(C16:G16))","v":6}]
[null,"Dundee",10,2,5,"-",2,19]
[null,"Angus",3,"-","-","-",1,4]
[]
["East"]
{"$rows_left_out":30}
{"sheet":"Items Found - Other","index":13,"n_rows":49,"n_cols":8,"rows_kept":49,"cut":false,"hidden":false,"merged":[]}
["Table 2.4"]
["Other Items found by Local Authority Area - Police Scotland"]
[{"$f":"'Number of Searches'!$A$3","v":"Period: April to September 2024"}]
[]
[null,"Local Authority","Firearms","Fireworks","Stolen Property","Alcohol","Other","Total"]
[]
[null,null,"Number of searches where other items were found"]
["North"]
[null,"Highland",1,"-",10,3,4,{"$f":"SUM(C9:G9)","v":18}]
[null,"Orkney Islands","-","-","-","-","-",{"$f":"IF(SUM(C10:G10) =0,\"-\",SUM(C10:G10))","v":"-"}]
[null,"Shetland Islands","-","-",1,"-",1,{"$f":"IF(SUM(C11:G11)=0,\"-\",SUM(C11:G11))","v":2}]
[null,"Eilean Siar","-","-","-","-","-",{"$f":"IF(SUM(C12:G12)=0,\"-\",SUM(C12:G12))","v":"-"}]
[null,"Aberdeen City",1,"-",8,3,2,{"$f":"IF(SUM(C13:G13)=0,\"-\",SUM(C13:G13))","v":14}]
[null,"Aberdeenshire","-","-",2,3,3,{"$f":"IF(SUM(C14:G14)=0,\"-\",SUM(C14:G14))","v":8}]
[null,"Moray","-","-",1,"-","-",{"$f":"IF(SUM(C15:G15)=0,\"-\",SUM(C15:G15))","v":1}]
[null,"Perth & Kinross","-","-",4,"-","-",{"$f":"SUM(C16:G16)","v":4}]
[null,"Dundee","-","-",25,1,4,{"$f":"SUM(C17:G17)","v":30}]
[null,"Angus",1,"-",4,3,7,{"$f":"IF(SUM(C18:G18)=0,\"-\",SUM(C18:G18))","v":15}]
[]
["East"]
{"$rows_left_out":30}
{"sheet":"Searches by Ethnicity ","index":14,"n_rows":52,"n_cols":4,"rows_kept":52,"cut":false,"hidden":false,"merged":[]}
["Table 3.1"]
["Searches by Ethnicity/National Origin - Police Scotland"]
[{"$f":"'Number of Searches'!$A$3","v":"Period: April to September 2024"}]
[]
["Ethnicity/National Origin","Number of Searches","Positive Searches","Positive Rate (%)"]
[]
[null,"Number"]
["White Scottish",15736,3935,{"$f":"IFERROR(C8/B8*100,\"-\")","v":25.006354855109304}]
["White British Other",825,233,{"$f":"IFERROR(C9/B9*100,\"-\")","v":28.242424242424242}]
["White Irish",50,7,14.000000000000002]
["White Gypsy/Traveller",22,8,36.363636363636367]
["White Polish",193,62,32.124352331606218]
["White Other",314,102,32.484076433121018]
["Any Mixed Ethnic Group",205,53,25.853658536585368]
["Pakistani",284,73,25.704225352112676]
["Indian",46,12,26.086956521739129]
["Bangladeshi",6,1,16.666666666666664]
["Chinese",41,6,14.634146341463413]
["Asian Other",191,59,30.890052356020941]
["African, African Scottish, African British",276,64,23.188405797101449]
{"$rows_left_out":33}
{"sheet":"Searches By Age and Gender","index":15,"n_rows":52,"n_cols":4,"rows_kept":52,"cut":false,"hidden":false,"merged":[]}
["Table 3.2"]
["Searches by Age and Gender - Police Scotland"]
[{"$f":"'Number of Searches'!$A$3","v":"Period: April to September 2024"}]
[]
["Demographic","Number of Searches","Positive Searches","Positive Rate (%)"]
[]
["Gender","Number"]
["Male",15921,4104,{"$f":"IFERROR(C8/B8*100,\"-\")","v":25.777275296777841}]
["Female",3077,679,{"$f":"IFERROR(C9/B9*100,\"-\")","v":22.066948326291843}]
["Not Provided","-","-","-"]
[]
["Age Group"]
["1 - 11 Years",30,1,{"$f":"IFERROR(C13/B13*100,\"-\")","v":3.3333333333333335}]
["12 - 15 Years",1578,238,{"$f":"IFERROR(C14/B14*100,\"-\")","v":15.082382762991129}]
["16 - 17 Years",1445,327,22.629757785467127]
["18 - 19 Years",1227,325,26.487367563162184]
["20 - 24 Years",2507,783,31.232548863183084]
["25 - 29 Years",2087,645,30.905606133205559]
["30 - 39 Years",4384,1194,27.235401459854014]
["40 - 49 Years",3685,902,24.477611940298509]
{"$rows_left_out":33}
{"sheet":"S60 Auths","index":16,"n_rows":17,"n_cols":5,"rows_kept":17,"cut":false,"hidden":false,"merged":[]}
["Table 4.1"]
["Use of powers under Section 60 Criminal Justice and Public Order Act 1994 - Police Scotland"]
[{"$f":"'Number of Searches'!$A$3","v":"Period: April to September 2024"}]
[]
["A total of 0 stop searches have been carried out under Section 60 Criminal Justice and Public Order Act 1994 authorisations recorded as detailed in the table below:"]
[]
["Authorisation Date","Local Authority Area","Authorising Officer Rank","Authorisation Type","Number of Searches"]
[]
[]
[]
[]
[]
[]
[]
[]
[]
["The \"pre-planned\" authorisation relates to n/a"]